Kdenlive   bug tracker Home page

View Issue Details Jump to Notes ] Issue History ] Print ]
IDProjectCategoryView StatusDate SubmittedLast Update
0002031KdenliveBuild Systempublic2011-02-19 16:412011-06-10 10:49
Reportersunab 
Assigned Tottill 
PrioritynormalSeverityblockReproducibilityalways
StatusclosedResolutionfixed 
Platformall (i386, amd64, lpia)OSUbuntu LinuxOS Version9.10
Product VersionRecent git 
Target VersionFixed in Version0.8 
Summary0002031: fails to build with Qt 4.5
Descriptionrevision 5427 fails to build with :

/build/buildd/kdenlive-0.7.8+svn20110219.r5427/src/timecodedisplay.cpp: In constructor 'TimecodeDisplay::TimecodeDisplay(Timecode, QWidget*)':
/build/buildd/kdenlive-0.7.8+svn20110219.r5427/src/timecodedisplay.cpp:43: error: 'contentsMargins' was not declared in this scope
make[3]: *** [src/cmake_bindir/CMakeFiles/kdenlive.dir/timecodedisplay.o] Error 1

Same revision builds fine with all newer Ubuntu versions.
TagsNo tags attached.
Build/Install Method(select)
Attached Files

- Relationships

-  Notes
(0006449)
ttill (developer)
2011-02-19 16:56

Should be fixed in r5428
(0006450)
sunab (reporter)
2011-02-19 21:45

revision 5429 fails with :

/build/buildd/kdenlive-0.7.8+svn20110219.r5429/src/onmonitoritems/rotoscoping/bpointitem.cpp: In member function 'virtual void BPointItem::paint(QPainter*, const QStyleOptionGraphicsItem*, QWidget*)':
/build/buildd/kdenlive-0.7.8+svn20110219.r5429/src/onmonitoritems/rotoscoping/bpointitem.cpp:93: error: 'tmp' was not declared in this scope
/build/buildd/kdenlive-0.7.8+svn20110219.r5429/src/onmonitoritems/rotoscoping/bpointitem.cpp:95: error: 'p' was not declared in this scope
make[3]: *** [src/cmake_bindir/CMakeFiles/kdenlive.dir/onmonitoritems/rotoscoping/bpointitem.o] Error 1
(0006452)
ttill (developer)
2011-02-19 23:01

Should be fixed in r5431.
Sorry for all the mess, I really have to start testing what I write for Qt < 4.6.
(0006453)
sunab (reporter)
2011-02-20 00:15
edited on: 2011-02-20 00:15

revision 5431 fails with :
/build/buildd/kdenlive-0.7.8+svn20110219.r5431/src/onmonitoritems/rotoscoping/splineitem.cpp: In member function 'int SplineItem::getClosestPointOnCurve(QPointF, double*)':
/build/buildd/kdenlive-0.7.8+svn20110219.r5431/src/onmonitoritems/rotoscoping/splineitem.cpp:252: error: 'const class QPointF' has no member named 'manhattanLength'
/build/buildd/kdenlive-0.7.8+svn20110219.r5431/src/onmonitoritems/rotoscoping/splineitem.cpp:276: error: 'const class QPointF' has no member named 'manhattanLength'
make[3]: *** [src/cmake_bindir/CMakeFiles/kdenlive.dir/onmonitoritems/rotoscoping/splineitem.o] Error 1

(0006454)
ttill (developer)
2011-02-20 00:29

Next try: 5433
(0006455)
sunab (reporter)
2011-02-20 02:15

Fixed, thanks.

- Issue History
Date Modified Username Field Change
2011-02-19 16:41 sunab New Issue
2011-02-19 16:56 ttill Note Added: 0006449
2011-02-19 16:56 ttill Assigned To => ttill
2011-02-19 16:56 ttill Status new => feedback
2011-02-19 21:45 sunab Note Added: 0006450
2011-02-19 21:45 sunab Status feedback => assigned
2011-02-19 23:01 ttill Note Added: 0006452
2011-02-19 23:02 ttill Status assigned => feedback
2011-02-20 00:15 sunab Note Added: 0006453
2011-02-20 00:15 sunab Status feedback => assigned
2011-02-20 00:15 sunab Note Edited: 0006453 View Revisions
2011-02-20 00:29 ttill Note Added: 0006454
2011-02-20 00:29 ttill Status assigned => feedback
2011-02-20 02:15 sunab Note Added: 0006455
2011-02-20 02:15 sunab Status feedback => assigned
2011-02-20 10:59 ttill Status assigned => resolved
2011-02-20 10:59 ttill Fixed in Version => Recent git
2011-02-20 10:59 ttill Resolution open => fixed
2011-04-26 21:58 j-b-m Fixed in Version Recent git => 0.8
2011-06-10 10:49 Granjow Status resolved => closed


Copyright © 2000 - 2014 MantisBT Team
Powered by Mantis Bugtracker