[SOLVED] Kdenlive 0.9.3GIT compile fails at 86% in 'kthumb.cpp'


Trying to build GIT packages to help test for new Kdenlive release, all dependencies are present and builds as recent as last week were successful, using MLT 0.8.3 from GIT also as previously instructed. Compiling on AV Linux 6.0 with KDE4 4.4.5.

Terminal Output:

[ 86%] Building CXX object src/CMakeFiles/kdenlive.dir/markerdialog.o
[ 86%] Building CXX object src/CMakeFiles/kdenlive.dir/mltdevicecapture.o
/home/glen/Packaging/KDENLIVE/kdenlive/src/kthumb.cpp: In static member function ‘static QImage KThumb::getFrame(Mlt::Frame*, int, int, int)’:
/home/glen/Packaging/KDENLIVE/kdenlive/src/kthumb.cpp:229:41: error: no matching function for call to ‘QImage::fill(QColor)’
/home/glen/Packaging/KDENLIVE/kdenlive/src/kthumb.cpp:229:41: note: candidate is:
/usr/include/qt4/QtGui/qimage.h:209:10: note: void QImage::fill(uint)
/usr/include/qt4/QtGui/qimage.h:209:10: note: no known conversion for argument 1 from ‘QColor’ to ‘uint {aka unsigned int}’
make[2]: *** [src/CMakeFiles/kdenlive.dir/kthumb.o] Error 1
make[2]: *** Waiting for unfinished jobs....
make[1]: *** [src/CMakeFiles/kdenlive.dir/all] Error 2
make: *** [all] Error 2

Help appreciated, thanks for all the efforts going into the next release!


Issue now resolved, thanks very much for the prompt reply and solution to the issue!