Compilation error [Fixed]

kdenlive r1669
Kind regards, Jean-Michel

if g++ -DHAVE_CONFIG_H -I. -I. -I.. -I/usr/include/kde -I/usr/share/qt3/include -I.  -I/usr/include -I/usr/include/mlt -D_REENTRANT   -D__STDC_CONSTANT_MACROS  -DQT_THREAD_SUPPORT  -D_REENTRANT  -Wno-long-long -Wundef -ansi -D_XOPEN_SOURCE=500 -D_BSD_SOURCE -Wcast-align -Wchar-subscripts -Wall -W -Wpointer-arith -fno-builtin -g3 -fno-inline -Wformat-security -Wmissing-format-attribute -Wno-non-virtual-dtor -fno-exceptions -fno-check-new -fno-common -DMLT_PREFIX=\""/usr"\" -DENABLE_FIREWIRE  -MT effectstackdialog.o -MD -MP -MF ".deps/effectstackdialog.Tpo" -c -o effectstackdialog.o effectstackdialog.cpp; \
        then mv -f ".deps/effectstackdialog.Tpo" ".deps/effectstackdialog.Po"; else rm -f ".deps/effectstackdialog.Tpo"; exit 1; fi
effectstackdialog.cpp: In member function ‘void Gui::EffectStackDialog::addParameters(DocClipRef*, Effect*)’:
effectstackdialog.cpp:195: attention : converting to ‘int’ from ‘double’
effectstackdialog.cpp:196: attention : converting to ‘int’ from ‘double’
effectstackdialog.cpp:252: attention : converting to ‘uint’ from ‘double’
effectstackdialog.cpp:254: attention : converting to ‘uint’ from ‘double’
effectstackdialog.cpp: In member function ‘void Gui::EffectStackDialog::slotSetEffectStack(DocClipRef*)’:
effectstackdialog.cpp:679: attention : unused variable ‘effect’
if g++ -DHAVE_CONFIG_H -I. -I. -I.. -I/usr/include/kde -I/usr/share/qt3/include -I.  -I/usr/include -I/usr/include/mlt -D_REENTRANT   -D__STDC_CONSTANT_MACROS  -DQT_THREAD_SUPPORT  -D_REENTRANT  -Wno-long-long -Wundef -ansi -D_XOPEN_SOURCE=500 -D_BSD_SOURCE -Wcast-align -Wchar-subscripts -Wall -W -Wpointer-arith -fno-builtin -g3 -fno-inline -Wformat-security -Wmissing-format-attribute -Wno-non-virtual-dtor -fno-exceptions -fno-check-new -fno-common -DMLT_PREFIX=\""/usr"\" -DENABLE_FIREWIRE  -MT effectstacklistview.o -MD -MP -MF ".deps/effectstacklistview.Tpo" -c -o effectstacklistview.o effectstacklistview.cpp; \
        then mv -f ".deps/effectstacklistview.Tpo" ".deps/effectstacklistview.Po"; else rm -f ".deps/effectstacklistview.Tpo"; exit 1; fi
effectstacklistview.cpp:55: attention : unused parameter ‘isOn’
effectstacklistview.cpp:132: attention : unused parameter ‘parent’
if g++ -DHAVE_CONFIG_H -I. -I. -I.. -I/usr/include/kde -I/usr/share/qt3/include -I.  -I/usr/include -I/usr/include/mlt -D_REENTRANT   -D__STDC_CONSTANT_MACROS  -DQT_THREAD_SUPPORT  -D_REENTRANT  -Wno-long-long -Wundef -ansi -D_XOPEN_SOURCE=500 -D_BSD_SOURCE -Wcast-align -Wchar-subscripts -Wall -W -Wpointer-arith -fno-builtin -g3 -fno-inline -Wformat-security -Wmissing-format-attribute -Wno-non-virtual-dtor -fno-exceptions -fno-check-new -fno-common -DMLT_PREFIX=\""/usr"\" -DENABLE_FIREWIRE  -MT exportdvddialog.o -MD -MP -MF ".deps/exportdvddialog.Tpo" -c -o exportdvddialog.o exportdvddialog.cpp; \
        then mv -f ".deps/exportdvddialog.Tpo" ".deps/exportdvddialog.Po"; else rm -f ".deps/exportdvddialog.Tpo"; exit 1; fi
exportdvddialog.cpp:126: erreur: prototype for ‘void Gui::ExportDvdDialog::slotUpdateNextButton()’ does not match any in class ‘Gui::ExportDvdDialog’
exportdvddialog.h:72: erreur: candidate is: void Gui::ExportDvdDialog::slotUpdateNextButton(bool)
exportdvddialog.cpp:132: attention : unused parameter ‘std’
exportdvddialog.cpp: In member function ‘void Gui::ExportDvdDialog::fillStructure(QDomDocument)’:
exportdvddialog.cpp:248: attention : unused variable ‘currentStart’
exportdvddialog.cpp: In member function ‘void Gui::ExportDvdDialog::generateMenuMovie()’:
exportdvddialog.cpp:509: attention : passing ‘double’ for argument 1 to ‘QString& QString::operator=(char)’
exportdvddialog.cpp:510: attention : passing ‘double’ for argument 1 to ‘QString& QString::operator=(char)’
exportdvddialog.cpp: In member function ‘void Gui::ExportDvdDialog::endExport(KProcess*)’:
exportdvddialog.cpp:811: attention : unused variable ‘finishedOK’
make[2]: *** [exportdvddialog.o] Erreur 1
make[2]: quittant le répertoire « /home/jmpoure/logiciels/kdenlive/kdenlive/kdenlive »
make[1]: *** [all-recursive] Erreur 1
make[1]: quittant le répertoire « /home/jmpoure/logiciels/kdenlive/kdenlive »
make: *** [all] Erreur 2

Forums: