compiling errors with build-script

hi,
installing kdenlive with the build-script today gives me an error as follows:


[ 90%] Building CXX object src/CMakeFiles/kdenlive.dir/recmonitor.o
/home/jhig/kdenlive/src/kdenlive/src/projectlist.h: In constructor 'ProjectList::ProjectList(QWidget*)':
/home/jhig/kdenlive/src/kdenlive/src/projectlist.h:317: warning: 'ProjectList::m_stabilizeAction' will be initialized after
/home/jhig/kdenlive/src/kdenlive/src/projectlist.h:316: warning: 'QMenu* ProjectList::m_transcodeAction'
/home/jhig/kdenlive/src/kdenlive/src/projectlist.cpp:199: warning: when initialized here
[ 90%] [ 91%] Building CXX object src/CMakeFiles/kdenlive.dir/renderer.o
/home/jhig/kdenlive/src/kdenlive/src/projectlist.cpp: In member function 'void ProjectList::slotUpdateClipProperties(ProjectItem*, QMap)':
/home/jhig/kdenlive/src/kdenlive/src/projectlist.cpp:928: warning: unused variable 'type'
Building CXX object src/CMakeFiles/kdenlive.dir/renderwidget.o
/home/jhig/kdenlive/src/kdenlive/src/projectlist.cpp: At global scope:
/home/jhig/kdenlive/src/kdenlive/src/projectlist.cpp:3084: warning: unused parameter 'label'
/home/jhig/kdenlive/src/kdenlive/src/projectlist.cpp:3084: warning: unused parameter 'actionName'
/home/jhig/kdenlive/src/kdenlive/src/projectlist.cpp:3084: warning: unused parameter 'details'
/home/jhig/kdenlive/src/kdenlive/src/projectlist.cpp: In member function 'void ProjectList::slotShowJobLog()':
/home/jhig/kdenlive/src/kdenlive/src/projectlist.cpp:3123: error: 'm_errorLog' was not declared in this scope
make[2]: *** [src/CMakeFiles/kdenlive.dir/projectlist.o] Error 1
make[2]: *** Waiting for unfinished jobs....
In file included from /home/jhig/kdenlive/src/kdenlive/src/blackmagic/include/DeckLinkAPI.h:34,
from /home/jhig/kdenlive/src/kdenlive/src/blackmagic/devices.h:5,
from /home/jhig/kdenlive/src/kdenlive/src/renderer.cpp:32:
/home/jhig/kdenlive/src/kdenlive/src/blackmagic/include/LinuxCOM.h:90: warning: 'class IUnknown' has virtual functions and accessible non-virtual destructor
In file included from /home/jhig/kdenlive/src/kdenlive/src/blackmagic/devices.h:5,
from /home/jhig/kdenlive/src/kdenlive/src/renderer.cpp:32:
/home/jhig/kdenlive/src/kdenlive/src/blackmagic/include/DeckLinkAPI.h:379: warning: 'class IDeckLinkMemoryAllocator' has virtual functions and accessible non-virtual destructor
/home/jhig/kdenlive/src/kdenlive/src/blackmagic/include/DeckLinkAPI.h:391: warning: 'class IDeckLinkAudioOutputCallback' has virtual functions and accessible non-virtual destructor
/home/jhig/kdenlive/src/kdenlive/src/blackmagic/include/DeckLinkAPI.h:399: warning: 'class IDeckLinkIterator' has virtual functions and accessible non-virtual destructor
make[1]: *** [src/CMakeFiles/kdenlive.dir/all] Error 2
make: *** [all] Error 2
ERROR: Unable to build kdenlive
LOG: Process has finished. Reason: FAILURE Some kind of error occured: Unable to build kdenlive

is this a known error?
thanx,
johannes

SOLVED:

updated to kde version:
kde-base/kdelibs-4.7.3-r1 (gentoo)

now it compiles and works.

bye,
johannes.

Thanks for your report, compilation should now be fixed with KDE

regards

i know, this is not really the right forum for this,
but since my update to kde 4.7 some fonts in kdenlive have a huge size. i tried the "systemconfiguration" tool from kde but nothing happened.
does someone have such problems too?

thanx,
johannes.